{"text_format":"1","workbook":"xlsx","n_sheets":12,"sheets":["QMS OPRISK","PENYATAAN","PENILAIAN (Q2)","PENILAIAN (Q4)","DASHBOARD","DATALIST","DATA","GRAF","PIVOT","Sheet4","DROPLIST","MATRIK"],"not_rendered":{"charts":8,"images":14,"macros":1,"external_links":1,"defined_names":29,"comments":1,"pivot_tables":10},"unopened":[],"bounds":{"document_bytes":16777216,"sheet_cells":100000,"rows_first":2000,"rows_last":500,"rows_between":2000,"halvings":0,"cell_chars":16384,"cell_head_chars":4096},"cells_cut":0,"cells_raw":0,"read":"whole","date_system":"1900"}

{"sheet":"QMS OPRISK","index":0,"n_rows":15,"n_cols":13,"rows_kept":15,"cut":false,"hidden":false,"merged":[[6,5,6,12],[8,5,8,12],[10,5,10,12],[12,5,12,12]]}
[]
[]
[]
[]
[]
[]
{"$rows_left_out":10}
{"sheet":"PENYATAAN","index":1,"n_rows":38,"n_cols":17,"rows_kept":38,"cut":false,"hidden":false,"merged":[[4,13,4,14],[4,6,5,12],[33,12,37,12],[6,12,7,12],[5,13,7,13],[5,14,7,14],[5,5,7,5],[6,6,6,8],[6,9,6,11],[4,0,4,5],[5,0,7,0],[5,1,7,1],[5,2,7,2],[5,3,7,3],[5,4,7,4]]}
[]
[]
[]
[]
["Penyataan Isu & Risiko",null,null,null,null,null,"Penilaian Risiko",null,null,null,null,null,null,"Tindakan Risiko"]
["Bil.","Penyataan Isu","Dalaman/ Luaran\n[DROPLIST]","Kategori Isu\n[DROPLIST]","Penyataan Risiko ","Kawalan Sedia ada",null,null,null,null,null,null,null,"Nyatakan Strategi Tindakan \nUntuk Risiko (Kuning) dan Risiko (Merah) sahaja","Dokumen Sokongan \n(Bukti tindakan)"]
{"$rows_left_out":33}
{"sheet":"PENILAIAN (Q2)","index":2,"n_rows":38,"n_cols":25,"rows_kept":38,"cut":false,"hidden":false,"merged":[[33,18,37,18],[33,9,37,9],[4,0,4,3],[4,4,4,11],[6,5,6,6],[6,7,6,8],[5,0,7,0],[5,1,7,1],[5,2,7,2],[5,3,7,3],[5,4,7,4],[33,4,37,5],[5,10,7,10],[5,11,7,11],[5,12,5,18],[4,12,4,21],[5,19,5,21],[5,5,5,8],[5,9,7,9],[6,12,6,14],[6,15,6,17],[6,18,7,18],[6,19,7,19],[6,20,7,20],[6,21,7,21]]}
[]
[]
[]
[]
["Penyataan Isu",null,null,null,"Penyataan Risiko & Tindakan",null,null,null,null,null,null,null,"Keberkesanan Tindakan (Semakan Sukuan Kedua 2019 - Q2)"]
["Bil.","Penyataan Isu","Dalaman/ Luaran\n[DROPLIST]","Kategori Isu*\n[DROPLIST]","Penyataan Risiko ","Penyata Risiko Secara Mudah",null,null,null,"Skor Penyataan Risiko","Nyatakan Strategi Tindakan \nUntuk Risiko (Kuning) dan Risiko (Merah) sahaja","Dokumen Sokongan \n(Bukti tindakan)","Penilaian Risiko",null,null,null,null,null,null,"Keputusan / Kawalan Tindakan Risiko"]
{"$rows_left_out":33}
{"sheet":"PENILAIAN (Q4)","index":3,"n_rows":38,"n_cols":18,"rows_kept":38,"cut":false,"hidden":true,"merged":[[33,13,37,13],[6,15,7,15],[5,5,7,5],[4,7,4,16],[5,7,5,13],[5,14,5,16],[6,7,6,9],[6,10,6,12],[6,13,7,13],[6,14,7,14],[6,16,7,16],[5,0,7,0],[4,5,4,6],[33,4,37,4],[4,0,4,3],[4,4,7,4],[5,1,7,1],[5,2,7,2],[5,3,7,3],[33,5,37,5],[33,6,37,6],[5,6,7,6]]}
[]
[]
[]
[]
["Penyataan Isu",null,null,null,"Penyataan Risiko ","Skor Risiko",null,"Keberkesanan Tindakan (Semakan Sukuan Ketiga / Keempat - Q3 / Q4)"]
["Bil.","Penyataan Isu","Dalaman/ Luaran\n[DROPLIST]","Kategori Isu\n[DROPLIST]",null,"Penyataan Risiko","Penilaian Risiko Q2","Penilaian Risiko",null,null,null,null,null,null,"Keputusan / Kawalan Tindakan Risiko"]
{"$rows_left_out":33}
{"sheet":"DASHBOARD","index":4,"n_rows":0,"n_cols":0,"rows_kept":0,"cut":false,"hidden":false,"merged":[]}

{"sheet":"DATALIST","index":5,"n_rows":21,"n_cols":19,"rows_kept":21,"cut":false,"hidden":true,"merged":[]}
["BIL","Klasifikasi PTJ","Nama PTJ","Nama PYB","Tahun","Penyataan Isu","Klasifikasi Isu","Kategori Isu","Penyataan Risiko","Kawalan Sedia Ada","Klasifikasi","XT","XS","YT","YS","XSYS","Tahap Risiko","Strategi","Dokumen"]
[{"$f":"PENYATAAN!A9","v":1},{"$f":"'QMS OPRISK'!F7","v":"Perkhidmatan"},{"$f":"'QMS OPRISK'!F9","v":"Putra Science Park"},{"$f":"'QMS OPRISK'!F11","v":"Shahriman bin Hashim"},{"$f":"'QMS OPRISK'!F13","v":2019},{"$f":"PENYATAAN!B9","v":"Pengurangan jumlah permohonan menyebabkan bilangan pemfailan  harta intelek  dalam dan luar negara  terjejas         "},{"$f":"PENYATAAN!C9","v":"Dalaman"},{"$f":"PENYATAAN!D9","v":"Penyelidikan & Inovasi"},{"$f":"PENYATAAN!E9","v":"i. Menjejaskan KPI Penyelidikan dan Inovasi (Pemfailan harta intelek)"},{"$f":"PENYATAAN!F9","v":"Seminar dan Klinik IP  di PTJ / atas permintaan PTJ"},{"$f":"PENYATAAN!P9","v":"1. Penyataan"},{"$f":"PENYATAAN!G9","v":"Tidak Ketara"},{"$f":"PENYATAAN!I9","v":1},{"$f":"PENYATAAN!J9","v":"Tidak Dapat Dijangka"},{"$f":"PENYATAAN!L9","v":1},{"$f":"M2*O2","v":1},{"$f":"IF(P2<=4,\"Rendah\",IF(P2<=12,\"Sederhana\",IF(P2<=25,\"Tinggi\")))","v":"Rendah"},{"$f":"PENYATAAN!N9","v":0},{"$f":"PENYATAAN!O9","v":"Pemantauan secara berterusan"}]
[{"$f":"PENYATAAN!A10","v":2},{"$f":"'QMS OPRISK'!F7","v":"Perkhidmatan"},{"$f":"C2","v":"Putra Science Park"},{"$f":"D2","v":"Shahriman bin Hashim"},{"$f":"E2","v":2019},{"$f":"PENYATAAN!B10","v":"Kekangan peruntukan bagi perlindungan harta intelek menyebab universiti menanggung kos perlindungan harta intelek luar negara yang tinggi "},{"$f":"PENYATAAN!C10","v":"Dalaman"},{"$f":"PENYATAAN!D10","v":"Penyelidikan & Inovasi"},{"$f":"PENYATAAN!E10","v":"i. Menjejaskan KPI Penyelidikan dan Inovasi (Pemfailan harta intelek)"},{"$f":"PENYATAAN!F10","v":"Menamatkan perlindungan paten luar negara melebihi 5 tahun yang tidak dikomersialkan  "},{"$f":"PENYATAAN!P10","v":"1. Penyataan"},{"$f":"PENYATAAN!G10","v":"Kecil"},{"$f":"PENYATAAN!I10","v":2},{"$f":"PENYATAAN!J10","v":"Jarang Sekali"},{"$f":"PENYATAAN!L10","v":2},{"$f":"M3*O3","v":4},{"$f":"IF(P3<=4,\"Rendah\",IF(P3<=12,\"Sederhana\",IF(P3<=25,\"Tinggi\")))","v":"Rendah"},{"$f":"PENYATAAN!N10","v":0},{"$f":"PENYATAAN!O10","v":"1. Pemantauan secara berterusan.\n\n2. Pembangunan garis panduan penamatan harta intelek telah dibentangkan sebanyak 2 kali dalam mesyuarat JKPU pada tahun 2018. Garis panduan ini akan dibawa untuk kelulusan mesyuarat Jwatankuasa Pengurusan Universiti."}]
[{"$f":"PENYATAAN!A11","v":3},{"$f":"'QMS OPRISK'!F7","v":"Perkhidmatan"},{"$f":"C3","v":"Putra Science Park"},{"$f":"D3","v":"Shahriman bin Hashim"},{"$f":"E3","v":2019},{"$f":"PENYATAAN!B11","v":"Pengiktirafan UPM sebagai organisasi pengurusan harta intelek terbaik negara meningkatkan peluang perniagaan baharu Putra Dynamic kerana menjadi pakar rujuk "},{"$f":"PENYATAAN!C11","v":"Dalaman"},{"$f":"PENYATAAN!D11","v":"Penyelidikan & Inovasi"},{"$f":"PENYATAAN!E11","v":"Meningkatkan bilangan peserta luar yang menyertai latihan "},{"$f":"PENYATAAN!F11","v":"Mengekalkan penyertaan Anugerah Harta Intelek Negara (AHIN)"},{"$f":"PENYATAAN!P11","v":"1. Penyataan"},{"$f":"PENYATAAN!G11","v":"Tidak Ketara"},{"$f":"PENYATAAN!I11","v":1},{"$f":"PENYATAAN!J11","v":"Tidak Dapat Dijangka"},{"$f":"PENYATAAN!L11","v":1},1,"Rendah",{"$f":"PENYATAAN!N11","v":0},{"$f":"PENYATAAN!O11","v":"Pemantauan secara berterusan"}]
[{"$f":"PENYATAAN!A12","v":4},{"$f":"'QMS OPRISK'!F7","v":"Perkhidmatan"},"Putra Science Park","Shahriman bin Hashim",2019,{"$f":"PENYATAAN!B12","v":"Pembayaran balik dana Mikrokredit tidak dilunaskan oleh peserta menyebabkan kurang dana untuk ditawarkan kepada peserta yang baharu"},{"$f":"PENYATAAN!C12","v":"Dalaman"},{"$f":"PENYATAAN!D12","v":"Penyelidikan & Inovasi"},{"$f":"PENYATAAN!E12","v":"Usahawan pelajar baharu tidak dapat dilahirkan "},{"$f":"PENYATAAN!F12","v":"`-notis bayaran secara bertulis dan telefon/ whatsapp\n- transkrip dan sijil bergraduat UPM tidak akan diberikan kepada pelajar"},{"$f":"PENYATAAN!P12","v":"1. Penyataan"},{"$f":"PENYATAAN!G12","v":"Kecil"},{"$f":"PENYATAAN!I12","v":2},{"$f":"PENYATAAN!J12","v":"Tidak Dapat Dijangka"},{"$f":"PENYATAAN!L12","v":1},2,"Rendah",{"$f":"PENYATAAN!N12","v":0},{"$f":"PENYATAAN!O12","v":"Pemantauan secara berterusan"}]
[{"$f":"PENYATAAN!A13","v":5},{"$f":"'QMS OPRISK'!F7","v":"Perkhidmatan"},"Putra Science Park","Shahriman bin Hashim",2019,{"$f":"PENYATAAN!B13","v":"Kurang penyertaan permohonan dana program Mikrokredit menyebabkan dana tidak dapat dimanfaatkan"},{"$f":"PENYATAAN!C13","v":"Dalaman"},{"$f":"PENYATAAN!D13","v":"Penyelidikan & Inovasi"},{"$f":"PENYATAAN!E13","v":"Usahawan pelajar baharu tidak dapat dilahirkan "},{"$f":"PENYATAAN!F13","v":"Sebarkan hebahan program melalui laman Web, CEM, Wazan dan Billboard UPM, facebook, Whatsapp Group"},{"$f":"PENYATAAN!P13","v":"1. Penyataan"},{"$f":"PENYATAAN!G13","v":"Kecil"},{"$f":"PENYATAAN!I13","v":2},{"$f":"PENYATAAN!J13","v":"Jarang Sekali"},{"$f":"PENYATAAN!L13","v":2},4,"Rendah",{"$f":"PENYATAAN!N13","v":0},{"$f":"PENYATAAN!O13","v":"Risiko telah dikawal"}]
{"$rows_left_out":16}
{"sheet":"DATA","index":6,"n_rows":76,"n_cols":21,"rows_kept":76,"cut":false,"hidden":false,"merged":[]}
["BIL","Klasifikasi PTJ","Nama PTJ","Nama PYB","Tahun","Penyataan Isu","Klasifikasi Isu","Kategori Isu","Penyataan Risiko","Kawalan Sedia Ada","Penilaian Risiko Berkala","XT","XS","YT","YS","XSYS","Tahap Risiko","Strategi Tindakan","Tindakan Atas Risiko","Dokumen","Catatan"]
[{"$f":"PENYATAAN!A9","v":1},{"$f":"'QMS OPRISK'!F7","v":"Perkhidmatan"},{"$f":"'QMS OPRISK'!F9","v":"Putra Science Park"},{"$f":"'QMS OPRISK'!$F$11","v":"Shahriman bin Hashim"},{"$f":"'QMS OPRISK'!F13","v":2019},{"$f":"PENYATAAN!B9","v":"Pengurangan jumlah permohonan menyebabkan bilangan pemfailan  harta intelek  dalam dan luar negara  terjejas         "},{"$f":"PENYATAAN!C9","v":"Dalaman"},{"$f":"PENYATAAN!D9","v":"Penyelidikan & Inovasi"},{"$f":"PENYATAAN!E9","v":"i. Menjejaskan KPI Penyelidikan dan Inovasi (Pemfailan harta intelek)"},{"$f":"PENYATAAN!F9","v":"Seminar dan Klinik IP  di PTJ / atas permintaan PTJ"},{"$f":"PENYATAAN!P9","v":"1. Penyataan"},{"$f":"PENYATAAN!J9","v":"Tidak Dapat Dijangka"},{"$f":"PENYATAAN!L9","v":1},{"$f":"PENYATAAN!G9","v":"Tidak Ketara"},{"$f":"PENYATAAN!I9","v":1},{"$f":"M2*O2","v":1},{"$f":"VLOOKUP(P2,DROPLIST!AB:AC,2,FALSE)","v":"Rendah"},{"$f":"PENYATAAN!N9","v":0},"-",{"$f":"PENYATAAN!O9","v":"Pemantauan secara berterusan"},"-"]
[{"$f":"PENYATAAN!A10","v":2},{"$f":"'QMS OPRISK'!F7","v":"Perkhidmatan"},{"$f":"'QMS OPRISK'!F9","v":"Putra Science Park"},{"$f":"'QMS OPRISK'!$F$11","v":"Shahriman bin Hashim"},{"$f":"'QMS OPRISK'!F13","v":2019},{"$f":"PENYATAAN!B10","v":"Kekangan peruntukan bagi perlindungan harta intelek menyebab universiti menanggung kos perlindungan harta intelek luar negara yang tinggi "},{"$f":"PENYATAAN!C10","v":"Dalaman"},{"$f":"PENYATAAN!D10","v":"Penyelidikan & Inovasi"},{"$f":"PENYATAAN!E10","v":"i. Menjejaskan KPI Penyelidikan dan Inovasi (Pemfailan harta intelek)"},{"$f":"PENYATAAN!F10","v":"Menamatkan perlindungan paten luar negara melebihi 5 tahun yang tidak dikomersialkan  "},{"$f":"PENYATAAN!P10","v":"1. Penyataan"},{"$f":"PENYATAAN!J10","v":"Jarang Sekali"},{"$f":"PENYATAAN!L10","v":2},{"$f":"PENYATAAN!G10","v":"Kecil"},{"$f":"PENYATAAN!I10","v":2},{"$f":"M3*O3","v":4},{"$f":"VLOOKUP(P3,DROPLIST!AB:AC,2,FALSE)","v":"Rendah"},{"$f":"PENYATAAN!N10","v":0},"-",{"$f":"PENYATAAN!O10","v":"1. Pemantauan secara berterusan.\n\n2. Pembangunan garis panduan penamatan harta intelek telah dibentangkan sebanyak 2 kali dalam mesyuarat JKPU pada tahun 2018. Garis panduan ini akan dibawa untuk kelulusan mesyuarat Jwatankuasa Pengurusan Universiti."},"-"]
[{"$f":"PENYATAAN!A11","v":3},{"$f":"'QMS OPRISK'!F7","v":"Perkhidmatan"},{"$f":"'QMS OPRISK'!F9","v":"Putra Science Park"},{"$f":"'QMS OPRISK'!$F$11","v":"Shahriman bin Hashim"},{"$f":"'QMS OPRISK'!F13","v":2019},{"$f":"PENYATAAN!B11","v":"Pengiktirafan UPM sebagai organisasi pengurusan harta intelek terbaik negara meningkatkan peluang perniagaan baharu Putra Dynamic kerana menjadi pakar rujuk "},{"$f":"PENYATAAN!C11","v":"Dalaman"},{"$f":"PENYATAAN!D11","v":"Penyelidikan & Inovasi"},{"$f":"PENYATAAN!E11","v":"Meningkatkan bilangan peserta luar yang menyertai latihan "},{"$f":"PENYATAAN!F11","v":"Mengekalkan penyertaan Anugerah Harta Intelek Negara (AHIN)"},{"$f":"PENYATAAN!P11","v":"1. Penyataan"},{"$f":"PENYATAAN!J11","v":"Tidak Dapat Dijangka"},{"$f":"PENYATAAN!L11","v":1},{"$f":"PENYATAAN!G11","v":"Tidak Ketara"},{"$f":"PENYATAAN!I11","v":1},1,{"$f":"VLOOKUP(P4,DROPLIST!AB:AC,2,FALSE)","v":"Rendah"},{"$f":"PENYATAAN!N11","v":0},"-",{"$f":"PENYATAAN!O11","v":"Pemantauan secara berterusan"},"-"]
[{"$f":"PENYATAAN!A12","v":4},{"$f":"'QMS OPRISK'!F7","v":"Perkhidmatan"},{"$f":"'QMS OPRISK'!F9","v":"Putra Science Park"},{"$f":"'QMS OPRISK'!$F$11","v":"Shahriman bin Hashim"},{"$f":"'QMS OPRISK'!F13","v":2019},{"$f":"PENYATAAN!B12","v":"Pembayaran balik dana Mikrokredit tidak dilunaskan oleh peserta menyebabkan kurang dana untuk ditawarkan kepada peserta yang baharu"},{"$f":"PENYATAAN!C12","v":"Dalaman"},{"$f":"PENYATAAN!D12","v":"Penyelidikan & Inovasi"},{"$f":"PENYATAAN!E12","v":"Usahawan pelajar baharu tidak dapat dilahirkan "},{"$f":"PENYATAAN!F12","v":"`-notis bayaran secara bertulis dan telefon/ whatsapp\n- transkrip dan sijil bergraduat UPM tidak akan diberikan kepada pelajar"},{"$f":"PENYATAAN!P12","v":"1. Penyataan"},{"$f":"PENYATAAN!J12","v":"Tidak Dapat Dijangka"},{"$f":"PENYATAAN!L12","v":1},{"$f":"PENYATAAN!G12","v":"Kecil"},{"$f":"PENYATAAN!I12","v":2},2,{"$f":"VLOOKUP(P5,DROPLIST!AB:AC,2,FALSE)","v":"Rendah"},{"$f":"PENYATAAN!N12","v":0},"-",{"$f":"PENYATAAN!O12","v":"Pemantauan secara berterusan"},"-"]
[{"$f":"PENYATAAN!A13","v":5},{"$f":"'QMS OPRISK'!F7","v":"Perkhidmatan"},{"$f":"'QMS OPRISK'!F9","v":"Putra Science Park"},{"$f":"'QMS OPRISK'!$F$11","v":"Shahriman bin Hashim"},{"$f":"'QMS OPRISK'!F13","v":2019},{"$f":"PENYATAAN!B13","v":"Kurang penyertaan permohonan dana program Mikrokredit menyebabkan dana tidak dapat dimanfaatkan"},{"$f":"PENYATAAN!C13","v":"Dalaman"},{"$f":"PENYATAAN!D13","v":"Penyelidikan & Inovasi"},{"$f":"PENYATAAN!E13","v":"Usahawan pelajar baharu tidak dapat dilahirkan "},{"$f":"PENYATAAN!F13","v":"Sebarkan hebahan program melalui laman Web, CEM, Wazan dan Billboard UPM, facebook, Whatsapp Group"},{"$f":"PENYATAAN!P13","v":"1. Penyataan"},{"$f":"PENYATAAN!J13","v":"Jarang Sekali"},{"$f":"PENYATAAN!L13","v":2},{"$f":"PENYATAAN!G13","v":"Kecil"},{"$f":"PENYATAAN!I13","v":2},4,{"$f":"VLOOKUP(P6,DROPLIST!AB:AC,2,FALSE)","v":"Rendah"},{"$f":"PENYATAAN!N13","v":0},"-",{"$f":"PENYATAAN!O13","v":"Risiko telah dikawal"},"-"]
{"$rows_left_out":71}
{"sheet":"GRAF","index":7,"n_rows":53,"n_cols":12,"rows_kept":53,"cut":false,"hidden":false,"merged":[]}
[]
[{"$f":"DATA!G1","v":"Klasifikasi Isu"},"Penyataan",null,"Isu Dalaman","Isu Luaran"]
["Dalaman",{"$f":"COUNTIF(DATA!G2:G26,\"Dalaman\")","v":16},null,{"$f":"B3","v":16},{"$f":"B4","v":5}]
["Luaran",{"$f":"COUNTIF(DATA!G2:G26,\"Luaran\")","v":5}]
["Jumlah Isu",{"$f":"SUM(B3:B4)","v":21}]
[]
{"$rows_left_out":48}
{"sheet":"PIVOT","index":8,"n_rows":52,"n_cols":13,"rows_kept":52,"cut":false,"hidden":false,"merged":[]}
[]
[]
["Row Labels","Count of Penyataan Isu"]
["Dalaman",16]
["Luaran",5]
["Pilihan Klasifikasi Isu",4]
{"$rows_left_out":47}
{"sheet":"Sheet4","index":9,"n_rows":66,"n_cols":16,"rows_kept":66,"cut":false,"hidden":false,"merged":[]}
[]
[]
["Row Labels","Count of Penyataan Isu",null,null,{"$f":"A4","v":"Dalaman"},{"$f":"A5","v":"Luaran"}]
["Dalaman",42,{"$f":"GETPIVOTDATA(\"Penyataan Isu\",$A$3,\"Klasifikasi Isu\",\"Dalaman\")","v":42},null,{"$f":"C4","v":42},{"$f":"C5","v":18}]
["Luaran",18,{"$f":"GETPIVOTDATA(\"Penyataan Isu\",$A$3,\"Klasifikasi Isu\",\"Luaran\")","v":18}]
["Grand Total",60]
{"$rows_left_out":61}
{"sheet":"DROPLIST","index":10,"n_rows":83,"n_cols":29,"rows_kept":83,"cut":false,"hidden":false,"merged":[]}
["Kategori PTJ",null,"Kategori","Nama PTJ",null,"Fakulti ","Sekolah","Akademi","Institut","Pusat","Pejabat","Bahagian","Kolej","Perkhidmatan",null,"Keterukan","Penerangan Keterukan","Skor",null,"Kemungkinan","Penerangan Keterukan","Skor",null,"Kaedah Kawalan","Penerangan",null,null,1,"Rendah"]
["Pilihan Kategori PTJ",null,"Sila Pilih","Pilihan PTJ",null,"Fakulti Bahasa Moden dan Komunikasi","Sekolah Pengajian Siswazah (SPS)","Akademi Sukan","Institut Biosains","Pusat Alumni","Pejabat Bursar","Bahagian Hal Ehwal Pelajar","Kolej Mohamad Rashid","Penerbit UPM",null,"Pilihan Tahap Keterukan","-",0,null,"Pilihan Tahap Kemungkinan","-",0,null,"Pilihan Kawalan","-",null,null,2,"Rendah"]
["Fakulti",null,"Fakulti ","Fakulti Bahasa Moden dan Komunikasi",null,"Fakulti Bioteknologi dan Sains Biomolekul",null,null,"Institut Kajian perladangan","Pusat Antarabangsa","Pejabat Pembangunan dan Pengurusan Aset","Bahagian Kaunseling ","Kolej Kedua","Perpustakaan Sultan Abdul Samad",null,"Tidak Ketara","Impak yang boleh diabaikan",1,null,"Tidak Dapat Dijangka","Boleh dikatakan mustahil dan tidak pernah berlaku",1,null,"Tolak Ansur (Tolerate)","Risiko yang boleh diterima oleh Pusat Tanggungjawab (PTJ) tanpa sebarang kerugian. Risiko ini boleh dikawal secara efisien menggunakan sistem kawalan sedia ada",null,null,3,"Rendah"]
["Sekolah",null,"Fakulti ","Fakulti Bioteknologi dan Sains Biomolekul",null,"Fakulti Ekologi Manusia",null,null,"Institut Kajian Dasar Pertanian dan Makanan","Pusat Asasi Sains Pertanian","Pejabat Penasihat Undang-undang","Bahagian Kemasukan & Tadbir Urus Akademik ","Kolej Ketiga","Putra Science Park",null,"Kecil","Impak yang boleh dikendalikan di peringkat Bahagian/Jabatan/Unit di PTJ",2,null,"Jarang Sekali","Belum diketahui berlaku selepas beberapa tahun",2,null,"Rawat \n(Treat)","Risiko yang boleh dirawat oleh PTJ dengan menggunakan sumber sedia ada. Kombinasi hierarki kawalan adalah sesuai diamalkan bagi memastikan kadar risiko adalah sentiasa terkawal",null,null,4,"Rendah"]
["Akademi",null,"Fakulti ","Fakulti Ekologi Manusia",null,"Fakulti Ekonomi dan Pengurusan",null,null,"Institut Pengajian Sains Sosial","Pusat Hubungan dan Jaringan Industri CIRNET","Pejabat Pendaftar","Bahagian Keselamatan Universiti","Kolej Canselor","Taman Pertanian Universiti",null,"Sederhana","Impak yang boleh dikendalikan secara normal oleh Pengurusan PTJ",3,null,"Dapat Dijangka","Mungkin berlaku pada masa akan datang",3,null,"Pindah (Transfer)","Risiko yang boleh ditanggung oleh pihak lain selain PTJ sendiri atau risiko yang dikongsi PTJ bersama PTJ lain yang berkaitan. Pilihan ini adalah baik bagi mengawal risiko berkaitan sumber (antaranya: kewangan, aset, infrastruktur, ICT dan manusia)",null,null,5,"Sederhana"]
["Institut",null,"Fakulti ","Fakulti Ekonomi dan Pengurusan",null,"Fakulti Kejuruteraan",null,null,"Institut Penyelidikan Matematik","Pusat Islam","Bahagian Pentadbiran Pejabat Naib Canselor","Bahagian Audit Dalam","Kolej Kelima",null,null,"Tinggi","Impak yang menyebabkan Petunjuk Prestasi Utama (KPI)  UPM terjejas  teruk",4,null,"Mungkin","Mungkin boleh berlaku dan bukannya luar biasa",4,null,"Hapus (Terminate)","Risiko yang tidak boleh lagi ditanggung oleh PTJ secara berterusan hendaklah dihapuskan.  PTJ telah pun cuba menangani isu risiko ini dengan kaedah kawalan yang lain tetapi masih tidak berjaya",null,null,6,"Sederhana"]
{"$rows_left_out":78}
{"sheet":"MATRIK","index":11,"n_rows":19,"n_cols":36,"rows_kept":19,"cut":false,"hidden":false,"merged":[[14,1,18,1],[12,1,13,2],[12,3,12,7],[4,1,8,1],[2,1,3,2],[2,3,2,7],[11,1,11,7]]}
[null,null,null,{"$f":"GRAF!B5","v":21},{"$f":"D1","v":21},{"$f":"E1","v":21},21,21]
[null,null,null,null,null,null,null,null,null,null,"1x1","2x1","3x1","4x1","5x1","1x2","2x2","3x2","4x2","5x2","1x3","1x4","1x5","2x3","2x4","2x5","3x3","3x4","3x5","4x3","4x4","4x5","5x3","5x4","5x5"]
[null,"Risiko",null,"Kemungkinan**",null,null,null,null,null,"1. Penyataan",{"$f":"COUNTIFS(DATA!M2:M26,1,DATA!O2:O26,1)","v":4},{"$f":"COUNTIFS(DATA!M2:M26,2,DATA!O2:O26,1)","v":2},{"$f":"COUNTIFS(DATA!M2:M26,3,DATA!O2:O26,1)","v":1},{"$f":"COUNTIFS(DATA!M2:M26,4,DATA!O2:O26,1)","v":0},{"$f":"COUNTIFS(DATA!M2:M26,5,DATA!O2:O26,1)","v":0},{"$f":"COUNTIFS(DATA!M2:M26,1,DATA!O2:O26,2)","v":1},{"$f":"COUNTIFS(DATA!M2:M26,2,DATA!O2:O26,2)","v":5},{"$f":"COUNTIFS(DATA!M2:M26,3,DATA!O2:O26,2)","v":1},{"$f":"COUNTIFS(DATA!M2:M26,4,DATA!O2:O26,2)","v":0},{"$f":"COUNTIFS(DATA!M2:M26,5,DATA!O2:O26,2)","v":0},{"$f":"COUNTIFS(DATA!M2:M26,1,DATA!O2:O26,3)","v":4},{"$f":"COUNTIFS(DATA!M2:M26,1,DATA!O2:O26,4)","v":1},{"$f":"COUNTIFS(DATA!M2:M26,1,DATA!O2:O26,5)","v":0},{"$f":"COUNTIFS(DATA!M2:M26,2,DATA!O2:O26,3)","v":0},{"$f":"COUNTIFS(DATA!M2:M26,2,DATA!O2:O26,4)","v":0},{"$f":"COUNTIFS(DATA!M2:M26,2,DATA!O2:O26,5)","v":0},{"$f":"COUNTIFS(DATA!M2:M26,3,DATA!O2:O26,3)","v":1},{"$f":"COUNTIFS(DATA!M2:M26,3,DATA!O2:O26,4)","v":0},{"$f":"COUNTIFS(DATA!M2:M26,3,DATA!O2:O26,5)","v":0},{"$f":"COUNTIFS(DATA!M2:M26,4,DATA!O2:O26,3)","v":0},{"$f":"COUNTIFS(DATA!M2:M26,4,DATA!O2:O26,4)","v":0},{"$f":"COUNTIFS(DATA!M2:M26,4,DATA!O2:O26,5)","v":0},{"$f":"COUNTIFS(DATA!M2:M26,5,DATA!O2:O26,3)","v":1},{"$f":"COUNTIFS(DATA!M2:M26,5,DATA!O2:O26,4)","v":0},{"$f":"COUNTIFS(DATA!M2:M26,5,DATA!O2:O26,5)","v":0},{"$f":"SUM(K3:AI3)","v":21}]
[null,null,null,1,2,3,4,5,null,"2. Penilaian - Q2",{"$f":"COUNTIFS(DATA!M27:M51,1,DATA!O27:O51,1)","v":9},{"$f":"COUNTIFS(DATA!M27:M51,2,DATA!O27:O51,1)","v":0},{"$f":"COUNTIFS(DATA!M27:M51,3,DATA!O27:O51,1)","v":0},{"$f":"COUNTIFS(DATA!M27:M51,4,DATA!O27:O51,1)","v":0},{"$f":"COUNTIFS(DATA!M27:M51,5,DATA!O27:O51,1)","v":0},{"$f":"COUNTIFS(DATA!M27:M51,1,DATA!O27:O51,2)","v":2},{"$f":"COUNTIFS(DATA!M27:M51,2,DATA!O27:O51,2)","v":4},{"$f":"COUNTIFS(DATA!M27:M51,3,DATA!O27:O51,2)","v":2},{"$f":"COUNTIFS(DATA!M27:M51,4,DATA!O27:O51,2)","v":0},{"$f":"COUNTIFS(DATA!M27:M51,5,DATA!O27:O51,2)","v":0},{"$f":"COUNTIFS(DATA!M27:M51,1,DATA!O27:O51,3)","v":3},{"$f":"COUNTIFS(DATA!M27:M51,1,DATA!O27:O51,4)","v":0},{"$f":"COUNTIFS(DATA!M27:M51,1,DATA!O27:O51,5)","v":0},{"$f":"COUNTIFS(DATA!M27:M51,2,DATA!O27:O51,3)","v":0},{"$f":"COUNTIFS(DATA!M27:M51,2,DATA!O27:O51,4)","v":0},{"$f":"COUNTIFS(DATA!M27:M51,2,DATA!O27:O51,5)","v":0},{"$f":"COUNTIFS(DATA!M27:M51,3,DATA!O27:O51,3)","v":1},{"$f":"COUNTIFS(DATA!M27:M51,3,DATA!O27:O51,4)","v":0},{"$f":"COUNTIFS(DATA!M27:M51,3,DATA!O27:O51,5)","v":0},{"$f":"COUNTIFS(DATA!M27:M51,4,DATA!O27:O51,3)","v":0},{"$f":"COUNTIFS(DATA!M27:M51,4,DATA!O27:O51,4)","v":0},{"$f":"COUNTIFS(DATA!M27:M51,4,DATA!O27:O51,5)","v":0},{"$f":"COUNTIFS(DATA!M27:M51,5,DATA!O27:O51,3)","v":0},{"$f":"COUNTIFS(DATA!M27:M51,5,DATA!O27:O51,4)","v":0},{"$f":"COUNTIFS(DATA!M27:M51,5,DATA!O27:O51,5)","v":0},{"$f":"SUM(K4:AI4)","v":21}]
[null,"Keterukan*",1,1,2,3,4,5,null,"3. Penilaian - Q4",{"$f":"COUNTIFS(DATA!M52:M76,1,DATA!O52:O76,1)","v":0},{"$f":"COUNTIFS(DATA!M52:M76,2,DATA!O52:O76,1)","v":0},{"$f":"COUNTIFS(DATA!M52:M76,3,DATA!O52:O76,1)","v":0},{"$f":"COUNTIFS(DATA!M52:M76,4,DATA!O52:O76,1)","v":0},{"$f":"COUNTIFS(DATA!M52:M76,5,DATA!O52:O76,1)","v":0},{"$f":"COUNTIFS(DATA!M52:M76,1,DATA!O52:O76,2)","v":0},{"$f":"COUNTIFS(DATA!M52:M76,2,DATA!O52:O76,2)","v":0},{"$f":"COUNTIFS(DATA!M52:M76,3,DATA!O52:O76,2)","v":0},{"$f":"COUNTIFS(DATA!M52:M76,4,DATA!O52:O76,2)","v":0},{"$f":"COUNTIFS(DATA!M52:M76,5,DATA!O52:O76,2)","v":0},{"$f":"COUNTIFS(DATA!M52:M76,1,DATA!O52:O76,3)","v":0},{"$f":"COUNTIFS(DATA!M52:M76,1,DATA!O52:O76,4)","v":0},{"$f":"COUNTIFS(DATA!M52:M76,1,DATA!O52:O76,5)","v":0},{"$f":"COUNTIFS(DATA!M52:M76,2,DATA!O52:O76,3)","v":0},{"$f":"COUNTIFS(DATA!M52:M76,2,DATA!O52:O76,4)","v":0},{"$f":"COUNTIFS(DATA!M52:M76,2,DATA!O52:O76,5)","v":0},{"$f":"COUNTIFS(DATA!M52:M76,3,DATA!O52:O76,3)","v":0},{"$f":"COUNTIFS(DATA!M52:M76,3,DATA!O52:O76,4)","v":0},{"$f":"COUNTIFS(DATA!M52:M76,3,DATA!O52:O76,5)","v":0},{"$f":"COUNTIFS(DATA!M52:M76,4,DATA!O52:O76,3)","v":0},{"$f":"COUNTIFS(DATA!M52:M76,4,DATA!O52:O76,4)","v":0},{"$f":"COUNTIFS(DATA!M52:M76,4,DATA!O52:O76,5)","v":0},{"$f":"COUNTIFS(DATA!M52:M76,5,DATA!O52:O76,3)","v":0},{"$f":"COUNTIFS(DATA!M52:M76,5,DATA!O52:O76,4)","v":0},{"$f":"COUNTIFS(DATA!M52:M76,5,DATA!O52:O76,5)","v":0},0]
[null,null,2,2,4,6,8,10]
{"$rows_left_out":13}